Reaction Details
TargetNuclear receptor coactivator 3
LigandBDBM57102
Substrate/Competitorn/a
Meas. Tech.Counterscreen for inhibitors of the Steroid Receptor Coactivator 1 (SRC1; NCOA1)
IC50 2893±n/a nM
Citation PubChem, PC Counterscreen for inhibitors of the Steroid Receptor Coactivator 1 (SRC1; NCOA1): Luminescence-based cell-based high throughput dose response assay to identify inhibitors of the Steroid Receptor Coactivator 3 (SRC3; NCOA3) PubChem Bioassay(2012)[AID]
 
Nuclear receptor coactivator 3
Name:Nuclear receptor coactivator 3
Type:Enzyme Catalytic Domain
Mol. Mass.:155305.29
Organism:Homo sapiens (Human)
Description:Q9Y6Q9
Residue:1424
BDBM57102
NameBDBM57102
Synonyms:MLS000541562 N-cyclohexyl-6-phenyl-3-pyridin-2-yl-1,2,4-triazin-5-amine cid_6404647 | cyclohexyl-[6-phenyl-3-(2-pyridyl)-1,2,4-triazin-5-yl]amine
TypeSmall organic molecule
Emp. Form.C20H21N5
Mol. Mass.331.4142
SMILESC1CCC(CC1)Nc1nc(nnc1-c1ccccc1)-c1ccccn1