Reaction Details
TargetNuclear receptor coactivator 3
LigandBDBM87066
Substrate/Competitorn/a
Meas. Tech.Counterscreen for inhibitors of the Steroid Receptor Coactivator 1 (SRC1; NCOA1)
IC50 1072±n/a nM
Citation PubChem, PC Counterscreen for inhibitors of the Steroid Receptor Coactivator 1 (SRC1; NCOA1): Luminescence-based cell-based high throughput dose response assay to identify inhibitors of the Steroid Receptor Coactivator 3 (SRC3; NCOA3) PubChem Bioassay(2012)[AID]
 
Nuclear receptor coactivator 3
Name:Nuclear receptor coactivator 3
Type:Enzyme Catalytic Domain
Mol. Mass.:155305.29
Organism:Homo sapiens (Human)
Description:Q9Y6Q9
Residue:1424
BDBM87066
NameBDBM87066
Synonyms:2HBA 3-[(5E)-5-[(4-methoxyphenyl)methylidene]-4-oxidanylidene-2-sulfanylidene-1,3-thiazolidin-3-yl]propanoic acid 3-[(5E)-5-[(4-methoxyphenyl)methylidene]-4-oxo-2-sulfanylidene-3-thiazolidinyl]propanoic acid SMR000131843 | cid_1201125
TypeSmall organic molecule
Emp. Form.C14H13NO4S2
Mol. Mass.323.387
SMILESCOc1ccc(\C=C2\SC(=S)N(CCC(O)=O)C2=O)cc1