Reaction Details
TargetNuclear receptor coactivator 3
LigandBDBM87271
Substrate/Competitorn/a
Meas. Tech.Counterscreen for inhibitors of the Steroid Receptor Coactivator 1 (SRC1; NCOA1)
IC50 1575±n/a nM
Citation PubChem, PC Counterscreen for inhibitors of the Steroid Receptor Coactivator 1 (SRC1; NCOA1): Luminescence-based cell-based high throughput dose response assay to identify inhibitors of the Steroid Receptor Coactivator 3 (SRC3; NCOA3) PubChem Bioassay(2012)[AID]
 
Nuclear receptor coactivator 3
Name:Nuclear receptor coactivator 3
Type:Enzyme Catalytic Domain
Mol. Mass.:155305.29
Organism:Homo sapiens (Human)
Description:Q9Y6Q9
Residue:1424
BDBM87271
NameBDBM87271
Synonyms:3-hydroxy-2-naphthalenecarbohydrazide 3-oxidanylnaphthalene-2-carbohydrazide SMR000207372 | cid_72699
TypeSmall organic molecule
Emp. Form.C11H10N2O2
Mol. Mass.202.2093
SMILESNNC(=O)c1cc2ccccc2cc1O