Reaction Details
TargetNuclear receptor coactivator 3
LigandBDBM7059
Substrate/Competitorn/a
Meas. Tech.Counterscreen for inhibitors of the Steroid Receptor Coactivator 1 (SRC1; NCOA1)
IC50 2091±n/a nM
Citation PubChem, PC Counterscreen for inhibitors of the Steroid Receptor Coactivator 1 (SRC1; NCOA1): Luminescence-based cell-based high throughput dose response assay to identify inhibitors of the Steroid Receptor Coactivator 3 (SRC3; NCOA3) PubChem Bioassay(2012)[AID]
 
Nuclear receptor coactivator 3
Name:Nuclear receptor coactivator 3
Type:Enzyme Catalytic Domain
Mol. Mass.:155305.29
Organism:Homo sapiens (Human)
Description:Q9Y6Q9
Residue:1424
BDBM7059
NameBDBM7059
Synonyms:cid_9583469
Typen/a
Emp. Form.C17H20Cl2N4O2
Mol. Mass.383.272
SMILESCc1nn(c(C)c1\C=N\OC(=O)Nc1ccc(Cl)c(Cl)c1)C(C)(C)C