Reaction Details
TargetNuclear receptor coactivator 3
LigandBDBM64005
Substrate/Competitorn/a
Meas. Tech.Counterscreen for inhibitors of the Steroid Receptor Coactivator 1 (SRC1; NCOA1)
IC50 2751±n/a nM
Citation PubChem, PC Counterscreen for inhibitors of the Steroid Receptor Coactivator 1 (SRC1; NCOA1): Luminescence-based cell-based high throughput dose response assay to identify inhibitors of the Steroid Receptor Coactivator 3 (SRC3; NCOA3) PubChem Bioassay(2012)[AID]
 
Nuclear receptor coactivator 3
Name:Nuclear receptor coactivator 3
Type:Enzyme Catalytic Domain
Mol. Mass.:155305.29
Organism:Homo sapiens (Human)
Description:Q9Y6Q9
Residue:1424
BDBM64005
NameBDBM64005
Synonyms:(6-Bromo-quinazolin-4-yl)-(2,4-dimethoxy-phenyl)-amine 6-bromanyl-N-(2,4-dimethoxyphenyl)quinazolin-4-amine 6-bromo-N-(2,4-dimethoxyphenyl)quinazolin-4-amine SMR000518844 | cid_1167228
TypeSmall organic molecule
Emp. Form.C16H14BrN3O2
Mol. Mass.360.205
SMILESCOc1ccc(Nc2ncnc3ccc(Br)cc23)c(OC)c1