Reaction Details
TargetNuclear receptor coactivator 1
LigandBDBM87252
Substrate/Competitorn/a
Meas. Tech.Luminescence-based cell-based high throughput dose response assay for inhibitors of the Steroid Receptor Coactivator 1 (SRC1; NCOA1)
IC50>1328±n/a nM
Citation PubChem, PC Luminescence-based cell-based high throughput dose response assay for inhibitors of the Steroid Receptor Coactivator 1 (SRC1; NCOA1) PubChem Bioassay(2012)[AID]
 
Nuclear receptor coactivator 1
Name:Nuclear receptor coactivator 1
Type:PROTEIN
Mol. Mass.:156749.34
Organism:Homo sapiens (Human)
Description:ChEMBL_759690
Residue:1441
BDBM87252
NameBDBM87252
Synonyms:7-Cyclopropyl-8H-imidazo[4',5':3,4]benzo[1,2-c][1,2,5]thiadiazole MLS000030244 cid_647662
TypeSmall organic molecule
Emp. Form.C10H8N4S
Mol. Mass.216.262
SMILESC1CC1c1nc2ccc3[nH]snc3c2n1