Reaction Details
TargetNuclear receptor coactivator 1
LigandBDBM57102
Substrate/Competitorn/a
Meas. Tech.Luminescence-based cell-based high throughput dose response assay for inhibitors of the Steroid Receptor Coactivator 1 (SRC1; NCOA1)
IC50 5220±n/a nM
Citation PubChem, PC Luminescence-based cell-based high throughput dose response assay for inhibitors of the Steroid Receptor Coactivator 1 (SRC1; NCOA1) PubChem Bioassay(2012)[AID]
 
Nuclear receptor coactivator 1
Name:Nuclear receptor coactivator 1
Type:PROTEIN
Mol. Mass.:156749.34
Organism:Homo sapiens (Human)
Description:ChEMBL_759690
Residue:1441
BDBM57102
NameBDBM57102
Synonyms:MLS000541562 N-cyclohexyl-6-phenyl-3-pyridin-2-yl-1,2,4-triazin-5-amine cid_6404647 | cyclohexyl-[6-phenyl-3-(2-pyridyl)-1,2,4-triazin-5-yl]amine
TypeSmall organic molecule
Emp. Form.C20H21N5
Mol. Mass.331.4142
SMILESC1CCC(CC1)Nc1nc(nnc1-c1ccccc1)-c1ccccn1