Reaction Details
TargetNuclear receptor coactivator 1
LigandBDBM4389
Substrate/Competitorn/a
Meas. Tech.Luminescence-based cell-based high throughput dose response assay for inhibitors of the Steroid Receptor Coactivator 1 (SRC1; NCOA1)
IC50 7046±n/a nM
Citation PubChem, PC Luminescence-based cell-based high throughput dose response assay for inhibitors of the Steroid Receptor Coactivator 1 (SRC1; NCOA1) PubChem Bioassay(2012)[AID]
 
Nuclear receptor coactivator 1
Name:Nuclear receptor coactivator 1
Type:PROTEIN
Mol. Mass.:156749.34
Organism:Homo sapiens (Human)
Description:ChEMBL_759690
Residue:1441
BDBM4389
NameBDBM4389
Synonyms:cid_5172209
Typen/a
Emp. Form.C16H16F3N5
Mol. Mass.335.3269
SMILESCn1nc(c(C#N)c1N1CCN(CC1)c1ccccc1)C(F)(F)F