Reaction Details
TargetNuclear receptor coactivator 1
LigandBDBM87279
Substrate/Competitorn/a
Meas. Tech.Luminescence-based cell-based high throughput dose response assay for inhibitors of the Steroid Receptor Coactivator 1 (SRC1; NCOA1)
IC50 2843±n/a nM
Citation PubChem, PC Luminescence-based cell-based high throughput dose response assay for inhibitors of the Steroid Receptor Coactivator 1 (SRC1; NCOA1) PubChem Bioassay(2012)[AID]
 
Nuclear receptor coactivator 1
Name:Nuclear receptor coactivator 1
Type:PROTEIN
Mol. Mass.:156749.34
Organism:Homo sapiens (Human)
Description:ChEMBL_759690
Residue:1441
BDBM87279
NameBDBM87279
Synonyms:2-Chloro-N-(1,1-dioxo-tetrahydro-1lambda*6*-thiophen-3-yl)-N-phenyl-acetamide 2-chloro-N-(1,1-dioxo-3-thiolanyl)-N-phenylacetamide MLS000330976 SMR000221075 | cid_2772172
TypeSmall organic molecule
Emp. Form.C12H14ClNO3S
Mol. Mass.287.762
SMILESClCC(=O)N(C1CCS(=O)(=O)C1)c1ccccc1