Reaction Details
TargetNuclear receptor coactivator 1
LigandBDBM87330
Substrate/Competitorn/a
Meas. Tech.Luminescence-based cell-based high throughput dose response assay for inhibitors of the Steroid Receptor Coactivator 1 (SRC1; NCOA1)
IC50>443.1±n/a nM
Citation PubChem, PC Luminescence-based cell-based high throughput dose response assay for inhibitors of the Steroid Receptor Coactivator 1 (SRC1; NCOA1) PubChem Bioassay(2012)[AID]
 
Nuclear receptor coactivator 1
Name:Nuclear receptor coactivator 1
Type:PROTEIN
Mol. Mass.:156749.34
Organism:Homo sapiens (Human)
Description:ChEMBL_759690
Residue:1441
BDBM87330
NameBDBM87330
Synonyms:MLS000766234 TENIPOSIDE | cid_5396
TypeSmall organic molecule
Emp. Form.C32H32O13S
Mol. Mass.656.654
SMILESCOc1cc(cc(OC)c1O)C1C2C(COC2=O)C(OC2OC3COC(OC3C(O)C2O)c2cccs2)c2cc3OCOc3cc12