Reaction Details
TargetMelanocortin receptor 4
LigandBDBM50097098
Substrate/Competitorn/a
Meas. Tech.TRFRET-based cell-based high throughput dose response assay for biased ligands (antagonists) of the melanocortin 4 receptor (MC4R)
IC50>64555±n/a nM
Citation PubChem, PC TRFRET-based cell-based high throughput dose response assay for biased ligands (antagonists) of the melanocortin 4 receptor (MC4R) PubChem Bioassay(2012)[AID]
 
Melanocortin receptor 4
Name:Melanocortin receptor 4
Type:Enzyme
Mol. Mass.:36949.50
Organism:Homo sapiens (Human)
Description:P32245
Residue:332
BDBM50097098
NameBDBM50097098
Synonyms:2-(5-Chloro-thiophen-2-yl)-quinoline-4-carboxylic acid cid_625773
TypeSmall organic molecule
Emp. Form.C14H8ClNO2S
Mol. Mass.289.737
SMILESOC(=O)c1cc(nc2ccccc12)-c1ccc(Cl)s1