Reaction Details
TargetTyrosine-protein phosphatase non-receptor type 11
LigandBDBM46280
Substrate/Competitorn/a
Meas. Tech.Dose Response selectivity of inhibitors of Striatal-Enriched Phosphatase (STEP) in a SHP2 (PTPN11) Inhibition Assay
IC50 9520±n/a nM
Citation PubChem, PC Dose Response selectivity of inhibitors of Striatal-Enriched Phosphatase (STEP) in a SHP2 (PTPN11) Inhibition Assay PubChem Bioassay(2012)[AID]
 
Tyrosine-protein phosphatase non-receptor type 11
Name:Tyrosine-protein phosphatase non-receptor type 11
Type:Protein phosphatase
Mol. Mass.:68443.59
Organism:Homo sapiens (Human)
Description:Q06124
Residue:593
BDBM46280
NameBDBM46280
Synonyms:2-[4-[(Z)-[2-(4-ethylanilino)-4-keto-2-thiazolin-5-ylidene]methyl]phenoxy]acetic acid 2-[4-[(Z)-[2-(4-ethylanilino)-4-oxo-5-thiazolylidene]methyl]phenoxy]acetic acid MLS-0425605.0001 | cid_5765582
TypeSmall organic molecule
Emp. Form.C20H18N2O4S
Mol. Mass.382.433
SMILESCCc1ccc(NC2=NC(=O)C(S2)=Cc2ccc(OCC(O)=O)cc2)cc1