Reaction Details
Target26S proteasome non-ATPase regulatory subunit 14
LigandBDBM83506
Substrate/Competitorn/a
Meas. Tech.Dose response confirmation of uHTS RPN11 inhibitor hits in a Fluorescence Polarization assay
IC50 90±11 nM
Citation PubChem, PC Dose response confirmation of uHTS RPN11 inhibitor hits in a Fluorescence Polarization assay PubChem Bioassay(2012)[AID]
 
26S proteasome non-ATPase regulatory subunit 14
Name:26S proteasome non-ATPase regulatory subunit 14
Type:Protein
Mol. Mass.:34576.68
Organism:Homo sapiens (Human)
Description:O00487
Residue:310
BDBM83506
NameBDBM83506
Synonyms:(5Z)-5-[[2-(3-isopropoxypropylamino)-4-keto-9-methyl-pyrido[1,2-a]pyrimidin-3-yl]methylene]-3-propyl-2-thioxo-thiazolidin-4-one (5Z)-5-[[9-methyl-4-oxo-2-(3-propan-2-yloxypropylamino)-3-pyrido[1,2-a]pyrimidinyl]methylidene]-3-propyl-2-sulfanylidene-4-thiazolidinone 2-(3-Isopropoxy-propylamino)-9-methyl-3-[4-oxo-3-propyl-2-thioxo-thiazolidin-(5Z)-ylidenemethyl]-pyrid o[1,2-a]pyrimidin-4-one SMR000147996 | cid_1880983
TypeSmall organic molecule
Emp. Form.C22H28N4O3S2
Mol. Mass.460.613
SMILESCCCN1C(=S)S\C(=C/c2c(NCCCOC(C)C)nc3c(C)cccn3c2=O)C1=O