Reaction Details
Target26S proteasome non-ATPase regulatory subunit 14
LigandBDBM88839
Substrate/Competitorn/a
Meas. Tech.Dose response confirmation of uHTS RPN11 inhibitor hits in a Fluorescence Polarization assay
IC50 4180±290 nM
Citation PubChem, PC Dose response confirmation of uHTS RPN11 inhibitor hits in a Fluorescence Polarization assay PubChem Bioassay(2012)[AID]
 
26S proteasome non-ATPase regulatory subunit 14
Name:26S proteasome non-ATPase regulatory subunit 14
Type:Protein
Mol. Mass.:34576.68
Organism:Homo sapiens (Human)
Description:O00487
Residue:310
BDBM88839
NameBDBM88839
Synonyms:(4Z)-4-[(2-methyl-1H-indol-3-yl)methylene]-2-phenyl-2-oxazolin-5-one (4Z)-4-[(2-methyl-1H-indol-3-yl)methylidene]-2-phenyl-5-oxazolone SMR000155333 | cid_5397501
TypeSmall organic molecule
Emp. Form.C19H14N2O2
Mol. Mass.302.3267
SMILESCc1[nH]c2ccccc2c1\C=C1/N=C(OC1=O)c1ccccc1