Reaction Details
Target26S proteasome non-ATPase regulatory subunit 14
LigandBDBM45037
Substrate/Competitorn/a
Meas. Tech.Dose response confirmation of uHTS RPN11 inhibitor hits in a Fluorescence Polarization assay
IC50 3280±266 nM
Citation PubChem, PC Dose response confirmation of uHTS RPN11 inhibitor hits in a Fluorescence Polarization assay PubChem Bioassay(2012)[AID]
 
26S proteasome non-ATPase regulatory subunit 14
Name:26S proteasome non-ATPase regulatory subunit 14
Type:Protein
Mol. Mass.:34576.68
Organism:Homo sapiens (Human)
Description:O00487
Residue:310
BDBM45037
NameBDBM45037
Synonyms:(2Z)-2-[(2-hydroxy-5-nitro-anilino)methylene]benzothiophen-3-one (2Z)-2-[[(5-nitro-2-oxidanyl-phenyl)amino]methylidene]-1-benzothiophen-3-one MLS000579149 cid_5399788
TypeSmall organic molecule
Emp. Form.C15H10N2O4S
Mol. Mass.314.316
SMILESOc1ccc(cc1\[NH+]=C\[c-]1sc2ccccc2c1=O)[N+]([O-])=O