Reaction Details
Target26S proteasome non-ATPase regulatory subunit 14
LigandBDBM88962
Substrate/Competitorn/a
Meas. Tech.Dose response confirmation of uHTS RPN11 inhibitor hits in a Fluorescence Polarization assay
IC50 1040±134 nM
Citation PubChem, PC Dose response confirmation of uHTS RPN11 inhibitor hits in a Fluorescence Polarization assay PubChem Bioassay(2012)[AID]
 
26S proteasome non-ATPase regulatory subunit 14
Name:26S proteasome non-ATPase regulatory subunit 14
Type:Protein
Mol. Mass.:34576.68
Organism:Homo sapiens (Human)
Description:O00487
Residue:310
BDBM88962
NameBDBM88962
Synonyms:(6R,7R)-7-[[(2E)-2-(2-amino-1,3-thiazol-4-yl)-2-(carboxymethoxyimino)acetyl]amino]-3-ethenyl-8-oxo-5-thia-1-azabicyclo[4.2.0]oct-2-ene-2-carboxylic acid;hydrate (6R,7R)-7-[[(2E)-2-(2-aminothiazol-4-yl)-2-(carboxymethyloximino)acetyl]amino]-8-keto-3-vinyl-5-thia-1-azabicyclo[4.2.0]oct-2-ene-2-carboxylic acid;hydrate CEFIXIME MLS001076665 cid_56642849
TypeSmall organic molecule
Emp. Form.C16H15N5O7S2
Mol. Mass.453.45
SMILESNc1nc(cs1)C(=N/OCC(O)=O)\C(=O)N[C@H]1[C@H]2SCC(C=C)=C(N2C1=O)C(O)=O