Reaction Details
Target26S proteasome non-ATPase regulatory subunit 14
LigandBDBM66127
Substrate/Competitorn/a
Meas. Tech.Dose response confirmation of uHTS RPN11 inhibitor hits in a Fluorescence Polarization assay
IC50 2360±426 nM
Citation PubChem, PC Dose response confirmation of uHTS RPN11 inhibitor hits in a Fluorescence Polarization assay PubChem Bioassay(2012)[AID]
 
26S proteasome non-ATPase regulatory subunit 14
Name:26S proteasome non-ATPase regulatory subunit 14
Type:Protein
Mol. Mass.:34576.68
Organism:Homo sapiens (Human)
Description:O00487
Residue:310
BDBM66127
NameBDBM66127
Synonyms:(5E)-3-benzyl-5-(4-hydroxy-3,5-dimethoxy-benzylidene)-2-thioxo-thiazolidin-4-one (5E)-3-benzyl-5-[(4-hydroxy-3,5-dimethoxyphenyl)methylidene]-2-sulfanylidene-1,3-thiazolidin-4-one (5E)-5-[(4-hydroxy-3,5-dimethoxyphenyl)methylidene]-3-(phenylmethyl)-2-sulfanylidene-4-thiazolidinone SMR000555227 | cid_1214175
TypeSmall organic molecule
Emp. Form.C19H17NO4S2
Mol. Mass.387.473
SMILESCOc1cc(\C=C2\SC(=S)N(Cc3ccccc3)C2=O)cc(OC)c1O