Reaction Details
Target26S proteasome non-ATPase regulatory subunit 14
LigandBDBM88971
Substrate/Competitorn/a
Meas. Tech.Dose response confirmation of uHTS RPN11 inhibitor hits in a Fluorescence Polarization assay
IC50 914±320 nM
Citation PubChem, PC Dose response confirmation of uHTS RPN11 inhibitor hits in a Fluorescence Polarization assay PubChem Bioassay(2012)[AID]
 
26S proteasome non-ATPase regulatory subunit 14
Name:26S proteasome non-ATPase regulatory subunit 14
Type:Protein
Mol. Mass.:34576.68
Organism:Homo sapiens (Human)
Description:O00487
Residue:310
BDBM88971
NameBDBM88971
Synonyms:(2E)-2-[(2Z)-2-(3-bromanyl-5-methoxy-4-oxidanylidene-cyclohexa-2,5-dien-1-ylidene)ethylidene]-1H-quinazolin-4-one (2E)-2-[(2Z)-2-(3-bromo-5-methoxy-4-oxo-1-cyclohexa-2,5-dienylidene)ethylidene]-1H-quinazolin-4-one MLS001176873 cid_24762098
TypeSmall organic molecule
Emp. Form.C17H13BrN2O3
Mol. Mass.373.201
SMILESCOc1cc(C=Cc2nc3ccccc3c(=O)[nH]2)cc(Br)c1O