Reaction Details
Target26S proteasome non-ATPase regulatory subunit 14
LigandBDBM89034
Substrate/Competitorn/a
Meas. Tech.Dose response confirmation of uHTS RPN11 inhibitor hits in a Fluorescence Polarization assay
IC50 5420±432 nM
Citation PubChem, PC Dose response confirmation of uHTS RPN11 inhibitor hits in a Fluorescence Polarization assay PubChem Bioassay(2012)[AID]
 
26S proteasome non-ATPase regulatory subunit 14
Name:26S proteasome non-ATPase regulatory subunit 14
Type:Protein
Mol. Mass.:34576.68
Organism:Homo sapiens (Human)
Description:O00487
Residue:310
BDBM89034
NameBDBM89034
Synonyms:(1,2-dimethyl-3-imidazo[1,2-a]pyridin-4-iumyl)-diphenyl-sulfanylidenephosphorane;methyl sulfate (1,2-dimethylimidazo[1,2-a]pyridin-4-ium-3-yl)-diphenyl-thioxo-phosphorane;methyl sulfate MLS002703110 cid_56643192
TypeSmall organic molecule
Emp. Form.C21H20N2PS
Mol. Mass.363.435
SMILESCc1c([n+]2ccccc2n1C)P(=S)(c1ccccc1)c1ccccc1