Reaction Details
TargetProthrombin
LigandBDBM46226
Substrate/Competitorn/a
Meas. Tech.Dose Response validation of uHTS RPN11 inhibitor hits using a Thrombin Fluorescence Polarization assay
IC50 72500±9460 nM
Citation PubChem, PC Dose Response validation of uHTS RPN11 inhibitor hits using a Thrombin Fluorescence Polarization assay PubChem Bioassay(2012)[AID]
 
Prothrombin
Name:Prothrombin
Type:Enzyme
Mol. Mass.:70502.73
Organism:Bos taurus (Bovine)
Description:P00735
Residue:625
BDBM46226
NameBDBM46226
Synonyms:MLS-0266887.0001 | cid_2545524
TypeSmall organic molecule
Emp. Form.C25H22N2O8S2
Mol. Mass.542.581
SMILESCCOC(=O)c1sc2nc3c(SCCC(O)=O)cc(cn3c(=O)c2c1C)C(=O)c1cc(OC)ccc1O