Reaction Details
TargetHigh affinity choline transporter 1
LigandBDBM39693
Substrate/Competitorn/a
Meas. Tech.Dose responses of compounds that activate the Choline Transporter (CHT) - 10 point CRC
EC50 11370±n/a nM
Citation PubChem, PC Dose responses of compounds that activate the Choline Transporter (CHT) - 10 point CRC PubChem Bioassay(2012)[AID]
 
High affinity choline transporter 1
Name:High affinity choline transporter 1
Type:PROTEIN
Mol. Mass.:63194.33
Organism:Homo sapiens (Human)
Description:ChEMBL_1464247
Residue:580
BDBM39693
NameBDBM39693
Synonyms:1-[2-(diethylamino)ethyl]-N-[[1-(phenylmethyl)-2-benzimidazolyl]methyl]-2-benzimidazolamine 2-[2-[(1-benzylbenzimidazol-2-yl)methylamino]benzimidazol-1-yl]ethyl-diethyl-amine N-[(1-benzyl-1H-benzimidazol-2-yl)methyl]-1-[2-(diethylamino)ethyl]-1H-benzimidazol-2-amine SMR000140572 | cid_1253120
TypeSmall organic molecule
Emp. Form.C28H32N6
Mol. Mass.452.5939
SMILESCCN(CC)CCn1c(NCc2nc3ccccc3n2Cc2ccccc2)nc2ccccc12