Reaction Details
TargetHigh affinity choline transporter 1
LigandBDBM89143
Substrate/Competitorn/a
Meas. Tech.Dose responses of compounds that activate the Choline Transporter (CHT) - 10 point CRC
EC50 5670±n/a nM
Citation PubChem, PC Dose responses of compounds that activate the Choline Transporter (CHT) - 10 point CRC PubChem Bioassay(2012)[AID]
 
High affinity choline transporter 1
Name:High affinity choline transporter 1
Type:PROTEIN
Mol. Mass.:63194.33
Organism:Homo sapiens (Human)
Description:ChEMBL_1464247
Residue:580
BDBM89143
NameBDBM89143
Synonyms:MLS000581438 N-[3-(2,2-dimethyloxan-4-yl)-3-phenyl-propyl]-N-(1-phenylethyl)furan-2-carboxamide N-[3-(2,2-dimethyltetrahydro-2H-pyran-4-yl)-3-phenylpropyl]-N-(1-phenylethyl)-2-furamide SMR000200063 | cid_2957642
TypeSmall organic molecule
Emp. Form.C29H35NO3
Mol. Mass.445.5931
SMILESCC(N(CCC(C1CCOC(C)(C)C1)c1ccccc1)C(=O)c1ccco1)c1ccccc1