Reaction Details
TargetHigh affinity choline transporter 1
LigandBDBM89150
Substrate/Competitorn/a
Meas. Tech.Dose responses of compounds that activate the Choline Transporter (CHT) - 10 point CRC
EC50 17600±n/a nM
Citation PubChem, PC Dose responses of compounds that activate the Choline Transporter (CHT) - 10 point CRC PubChem Bioassay(2012)[AID]
 
High affinity choline transporter 1
Name:High affinity choline transporter 1
Type:PROTEIN
Mol. Mass.:63194.33
Organism:Homo sapiens (Human)
Description:ChEMBL_1464247
Residue:580
BDBM89150
NameBDBM89150
Synonyms:2-[(4E)-1-(3-chloranyl-4-methoxy-phenyl)-4-(furan-2-ylmethylidene)-5-oxidanylidene-imidazol-2-yl]sulfanyl-N,N-di(propan-2-yl)ethanamide 2-[[(4E)-1-(3-chloro-4-methoxy-phenyl)-4-(2-furfurylidene)-5-keto-2-imidazolin-2-yl]thio]-N,N-diisopropyl-acetamide MLS000394498 cid_2607886
TypeSmall organic molecule
Emp. Form.C23H26ClN3O4S
Mol. Mass.475.988
SMILESCOc1ccc(cc1Cl)N1C(SCC(=O)N(C(C)C)C(C)C)=N\C(=C\c2ccco2)C1=O