Reaction Details
TargetHigh affinity choline transporter 1
LigandBDBM89151
Substrate/Competitorn/a
Meas. Tech.Dose responses of compounds that activate the Choline Transporter (CHT) - 10 point CRC
EC50 18320±n/a nM
Citation PubChem, PC Dose responses of compounds that activate the Choline Transporter (CHT) - 10 point CRC PubChem Bioassay(2012)[AID]
 
High affinity choline transporter 1
Name:High affinity choline transporter 1
Type:PROTEIN
Mol. Mass.:63194.33
Organism:Homo sapiens (Human)
Description:ChEMBL_1464247
Residue:580
BDBM89151
NameBDBM89151
Synonyms:2-[2-(2-chlorophenyl)-1-benzimidazolyl]-N-(2-propan-2-ylphenyl)acetamide 2-[2-(2-chlorophenyl)benzimidazol-1-yl]-N-(2-propan-2-ylphenyl)ethanamide MLS000389022 cid_3418657
TypeSmall organic molecule
Emp. Form.C24H22ClN3O
Mol. Mass.403.904
SMILESCC(C)c1ccccc1NC(=O)Cn1c(nc2ccccc12)-c1ccccc1Cl