Reaction Details
TargetHigh affinity choline transporter 1
LigandBDBM89153
Substrate/Competitorn/a
Meas. Tech.Dose responses of compounds that activate the Choline Transporter (CHT) - 10 point CRC
EC50 12260±n/a nM
Citation PubChem, PC Dose responses of compounds that activate the Choline Transporter (CHT) - 10 point CRC PubChem Bioassay(2012)[AID]
 
High affinity choline transporter 1
Name:High affinity choline transporter 1
Type:PROTEIN
Mol. Mass.:63194.33
Organism:Homo sapiens (Human)
Description:ChEMBL_1464247
Residue:580
BDBM89153
NameBDBM89153
Synonyms:4-[(E,4R)-1-(benzyloxycarbonylamino)-5-keto-2,4-dimethyl-5-(veratrylamino)pent-2-enyl]benzoic acid methyl ester MLS000563590 cid_5459527 methyl 4-[(E,4R)-5-[(3,4-dimethoxyphenyl)methylamino]-2,4-dimethyl-5-oxo-1-(phenylmethoxycarbonylamino)pent-2-enyl]benzoate
TypeSmall organic molecule
Emp. Form.C32H36N2O7
Mol. Mass.560.6374
SMILESCOC(=O)c1ccc(cc1)C(NC(=O)OCc1ccccc1)C(\C)=C\[C@@H](C)C(=O)NCc1ccc(OC)c(OC)c1