Reaction Details
TargetHigh affinity choline transporter 1
LigandBDBM89154
Substrate/Competitorn/a
Meas. Tech.Dose responses of compounds that activate the Choline Transporter (CHT) - 10 point CRC
EC50 12450±n/a nM
Citation PubChem, PC Dose responses of compounds that activate the Choline Transporter (CHT) - 10 point CRC PubChem Bioassay(2012)[AID]
 
High affinity choline transporter 1
Name:High affinity choline transporter 1
Type:PROTEIN
Mol. Mass.:63194.33
Organism:Homo sapiens (Human)
Description:ChEMBL_1464247
Residue:580
BDBM89154
NameBDBM89154
Synonyms:1-[2-azanylidene-3-[2-(diethylamino)ethyl]benzimidazol-1-yl]-3-(3-methylphenoxy)propan-2-ol;hydrochloride 1-[3-[2-(diethylamino)ethyl]-2-imino-benzimidazol-1-yl]-3-(3-methylphenoxy)propan-2-ol;hydrochloride 1-{3-[2-(diethylamino)ethyl]-2-imino-2,3-dihydro-1H-benzimidazol-1-yl}-3-(3-methylphenoxy)-2-propanol hydrochloride SMR000293772 | cid_2952439
TypeSmall organic molecule
Emp. Form.C23H32N4O2
Mol. Mass.396.5258
SMILESCCN(CC)CCn1c2ccccc2n(CC(O)COc2cccc(C)c2)c1=N