Reaction Details
TargetHigh affinity choline transporter 1
LigandBDBM89155
Substrate/Competitorn/a
Meas. Tech.Dose responses of compounds that activate the Choline Transporter (CHT) - 10 point CRC
EC50 8420±n/a nM
Citation PubChem, PC Dose responses of compounds that activate the Choline Transporter (CHT) - 10 point CRC PubChem Bioassay(2012)[AID]
 
High affinity choline transporter 1
Name:High affinity choline transporter 1
Type:PROTEIN
Mol. Mass.:63194.33
Organism:Homo sapiens (Human)
Description:ChEMBL_1464247
Residue:580
BDBM89155
NameBDBM89155
Synonyms:4-(isoxazol-3-ylcarbamoylamino)benzoic acid ethyl ester MLS000679330 cid_6468758 ethyl 4-{[(3-isoxazolylamino)carbonyl]amino}benzoate
TypeSmall organic molecule
Emp. Form.C13H13N3O4
Mol. Mass.275.26
SMILESCCOC(=O)c1ccc(NC(=O)Nc2ccon2)cc1