Reaction Details
TargetHigh affinity choline transporter 1
LigandBDBM89157
Substrate/Competitorn/a
Meas. Tech.Dose responses of compounds that activate the Choline Transporter (CHT) - 10 point CRC
EC50 6690±n/a nM
Citation PubChem, PC Dose responses of compounds that activate the Choline Transporter (CHT) - 10 point CRC PubChem Bioassay(2012)[AID]
 
High affinity choline transporter 1
Name:High affinity choline transporter 1
Type:PROTEIN
Mol. Mass.:63194.33
Organism:Homo sapiens (Human)
Description:ChEMBL_1464247
Residue:580
BDBM89157
NameBDBM89157
Synonyms:MLS000731795 [1-[(1-pyrimidin-2-ylpyrrol-2-yl)methyl]piperidin-3-yl]-[3-(trifluoromethyl)phenyl]methanone [1-[[1-(2-pyrimidyl)pyrrol-2-yl]methyl]-3-piperidyl]-[3-(trifluoromethyl)phenyl]methanone {1-[(1-pyrimidin-2-yl-1H-pyrrol-2-yl)methyl]piperidin-3-yl}[3-(trifluoromethyl)phenyl]methanone
TypeSmall organic molecule
Emp. Form.C22H21F3N4O
Mol. Mass.414.4235
SMILESFC(F)(F)c1cccc(c1)C(=O)C1CCCN(Cc2cccn2-c2ncccn2)C1