Reaction Details
TargetHigh affinity choline transporter 1
LigandBDBM89163
Substrate/Competitorn/a
Meas. Tech.Dose responses of compounds that activate the Choline Transporter (CHT) - 10 point CRC
EC50 9770±n/a nM
Citation PubChem, PC Dose responses of compounds that activate the Choline Transporter (CHT) - 10 point CRC PubChem Bioassay(2012)[AID]
 
High affinity choline transporter 1
Name:High affinity choline transporter 1
Type:PROTEIN
Mol. Mass.:63194.33
Organism:Homo sapiens (Human)
Description:ChEMBL_1464247
Residue:580
BDBM89163
NameBDBM89163
Synonyms:2-(4-Methoxy-phenyl)-1-p-tolyl-6,7,8,9-tetrahydro-5H-imidazo[1,2-a]azepin-1-ium 2-(4-methoxyphenyl)-1-(p-tolyl)-6,7,8,9-tetrahydro-5H-imidaz[1,2-a]azepin-4-ium;bromide SMR000420198 | cid_16236316
TypeSmall organic molecule
Emp. Form.C22H25N2O
Mol. Mass.333.4462
SMILESCOc1ccc(cc1)-c1c[n+]2CCCCCc2n1-c1ccc(C)cc1