Reaction Details
TargetHigh affinity choline transporter 1
LigandBDBM89166
Substrate/Competitorn/a
Meas. Tech.Dose responses of compounds that activate the Choline Transporter (CHT) - 10 point CRC
EC50 22440±n/a nM
Citation PubChem, PC Dose responses of compounds that activate the Choline Transporter (CHT) - 10 point CRC PubChem Bioassay(2012)[AID]
 
High affinity choline transporter 1
Name:High affinity choline transporter 1
Type:PROTEIN
Mol. Mass.:63194.33
Organism:Homo sapiens (Human)
Description:ChEMBL_1464247
Residue:580
BDBM89166
NameBDBM89166
Synonyms:2-[2-(2-Methoxy-phenyl)-acetylamino]-4-methyl-thiazole-5-carboxylic acid ethyl ester 2-[[2-(2-methoxyphenyl)acetyl]amino]-4-methyl-thiazole-5-carboxylic acid ethyl ester SMR000524782 ethyl 2-[2-(2-methoxyphenyl)ethanoylamino]-4-methyl-1,3-thiazole-5-carboxylate | ethyl 2-[[2-(2-methoxyphenyl)acetyl]amino]-4-methyl-1,3-thiazole-5-carboxylate
TypeSmall organic molecule
Emp. Form.C16H18N2O4S
Mol. Mass.334.39
SMILESCCOC(=O)c1sc(NC(=O)Cc2ccccc2OC)nc1C