Reaction Details
TargetHigh affinity choline transporter 1
LigandBDBM89168
Substrate/Competitorn/a
Meas. Tech.Dose responses of compounds that activate the Choline Transporter (CHT) - 10 point CRC
EC50 8040±n/a nM
Citation PubChem, PC Dose responses of compounds that activate the Choline Transporter (CHT) - 10 point CRC PubChem Bioassay(2012)[AID]
 
High affinity choline transporter 1
Name:High affinity choline transporter 1
Type:PROTEIN
Mol. Mass.:63194.33
Organism:Homo sapiens (Human)
Description:ChEMBL_1464247
Residue:580
BDBM89168
NameBDBM89168
Synonyms:2-[[5-(1,3-benzodioxol-5-yl)-1,2-oxazol-3-yl]methoxy]-N-butyl-ethanamide 2-[[5-(1,3-benzodioxol-5-yl)-3-isoxazolyl]methoxy]-N-butylacetamide 2-{[5-(1,3-benzodioxol-5-yl)isoxazol-3-yl]methoxy}-N-butylacetamide SMR000563826 | cid_17253867
TypeSmall organic molecule
Emp. Form.C17H20N2O5
Mol. Mass.332.3511
SMILESCCCCNC(=O)COCc1cc(on1)-c1ccc2OCOc2c1