Reaction Details
TargetDNA (cytosine-5)-methyltransferase 1
LigandBDBM61185
Substrate/Competitorn/a
Meas. Tech.Dose response confirmation of DNMT1 inhibitors in a Fluorescent Molecular Beacon assay
IC50 2920±111 nM
Citation PubChem, PC Dose response confirmation of DNMT1 inhibitors in a Fluorescent Molecular Beacon assay PubChem Bioassay(2012)[AID]
 
DNA (cytosine-5)-methyltransferase 1
Name:DNA (cytosine-5)-methyltransferase 1
Type:Enzyme
Mol. Mass.:183184.85
Organism:Homo sapiens (Human)
Description:P26358
Residue:1616
BDBM61185
NameBDBM61185
Synonyms:(E)-3-(2-furanyl)-N-[[4-[(6-methoxy-4-pyrimidinyl)sulfamoyl]anilino]-sulfanylidenemethyl]-2-propenamide (E)-3-(furan-2-yl)-N-[[4-[(6-methoxypyrimidin-4-yl)sulfamoyl]phenyl]carbamothioyl]prop-2-enamide SMR000277748 | cid_1986560
TypeSmall organic molecule
Emp. Form.C19H17N5O5S2
Mol. Mass.459.499
SMILESCOc1cc(NS(=O)(=O)c2ccc(NC(=S)NC(=O)C=Cc3ccco3)cc2)ncn1