Reaction Details
TargetDNA (cytosine-5)-methyltransferase 1
LigandBDBM54979
Substrate/Competitorn/a
Meas. Tech.Dose response confirmation of DNMT1 inhibitors in a Fluorescent Molecular Beacon assay
IC50 3350±196 nM
Citation PubChem, PC Dose response confirmation of DNMT1 inhibitors in a Fluorescent Molecular Beacon assay PubChem Bioassay(2012)[AID]
 
DNA (cytosine-5)-methyltransferase 1
Name:DNA (cytosine-5)-methyltransferase 1
Type:Enzyme
Mol. Mass.:183184.85
Organism:Homo sapiens (Human)
Description:P26358
Residue:1616
BDBM54979
NameBDBM54979
Synonyms:2-[[2-[4-[(2-cyanoacetyl)amino]benzoyl]oxyacetyl]amino]-5,6,7,8-tetrahydro-4H-cyclohepta[b]thiophene-3-carboxylic acid methyl ester MLS000335296 cid_3621945 methyl 2-[[2-[4-[(2-cyanoacetyl)amino]benzoyl]oxyacetyl]amino]-5,6,7,8-tetrahydro-4H-cyclohepta[b]thiophene-3-carboxylate
TypeSmall organic molecule
Emp. Form.C23H23N3O6S
Mol. Mass.469.51
SMILESCOC(=O)c1c(NC(=O)COC(=O)c2ccc(NC(=O)CC#N)cc2)sc2CCCCCc12