Reaction Details
TargetDNA (cytosine-5)-methyltransferase 1
LigandBDBM50610
Substrate/Competitorn/a
Meas. Tech.Dose response confirmation of DNMT1 inhibitors in a Fluorescent Molecular Beacon assay
IC50 3250±99 nM
Citation PubChem, PC Dose response confirmation of DNMT1 inhibitors in a Fluorescent Molecular Beacon assay PubChem Bioassay(2012)[AID]
 
DNA (cytosine-5)-methyltransferase 1
Name:DNA (cytosine-5)-methyltransferase 1
Type:Enzyme
Mol. Mass.:183184.85
Organism:Homo sapiens (Human)
Description:P26358
Residue:1616
BDBM50610
NameBDBM50610
Synonyms:(8S)-3-[3-[(2-methyl-1-oxoprop-2-enyl)amino]phenyl]-7-[(2E,4E)-1-oxohexa-2,4-dienyl]-1-oxa-2,7-diazaspiro[4.4]non-2-ene-8-carboxamide (8S)-7-[(2E,4E)-hexa-2,4-dienoyl]-3-[3-(2-methylprop-2-enoylamino)phenyl]-1-oxa-2,7-diazaspiro[4.4]non-2-ene-8-carboxamide SMR000390646 | cid_16682067
TypeSmall organic molecule
Emp. Form.C23H26N4O4
Mol. Mass.422.4769
SMILESC\C=C\C=C\C(=O)N1CC2(C[C@H]1C(N)=O)CC(=NO2)c1cccc(NC(=O)C(C)=C)c1