Reaction Details
TargetDNA (cytosine-5)-methyltransferase 1
LigandBDBM89212
Substrate/Competitorn/a
Meas. Tech.Dose response confirmation of DNMT1 inhibitors in a Fluorescent Molecular Beacon assay
IC50 3500±79 nM
Citation PubChem, PC Dose response confirmation of DNMT1 inhibitors in a Fluorescent Molecular Beacon assay PubChem Bioassay(2012)[AID]
 
DNA (cytosine-5)-methyltransferase 1
Name:DNA (cytosine-5)-methyltransferase 1
Type:Enzyme
Mol. Mass.:183184.85
Organism:Homo sapiens (Human)
Description:P26358
Residue:1616
BDBM89212
NameBDBM89212
Synonyms:3-[(2Z)-3,7-dimethylocta-2,6-dienyl]-2-hydroxy-4-methoxy-6-(2-phenylethyl)benzoic acid 3-[(2Z)-3,7-dimethylocta-2,6-dienyl]-4-methoxy-2-oxidanyl-6-(2-phenylethyl)benzoic acid SMR001544281 | cid_44601732
TypeSmall organic molecule
Emp. Form.C26H32O4
Mol. Mass.408.5299
SMILES[#6]-[#8]-c1cc(-[#6]-[#6]-c2ccccc2)c(-[#6](-[#8])=O)c(-[#8])c1-[#6]\[#6]=[#6](\[#6])-[#6]-[#6]\[#6]=[#6](\[#6])-[#6]