Reaction Details
TargetZinc finger protein GLI1
LigandBDBM37170
Substrate/Competitorn/a
Meas. Tech.Dose response confirmation of uHTS antagonist hits from Gli-SUFU in a luminescent reporter assay
IC50 1980±n/a nM
Citation PubChem, PC Dose response confirmation of uHTS antagonist hits from Gli-SUFU in a luminescent reporter assay PubChem Bioassay(2012)[AID]
 
Zinc finger protein GLI1
Name:Zinc finger protein GLI1
Type:PROTEIN
Mol. Mass.:118579.34
Organism:Mus musculus
Description:EBI_101259
Residue:1111
BDBM37170
NameBDBM37170
Synonyms:3-methyl-4-oxo-6-(3,4,5-trimethoxyphenyl)-1,5,6,7-tetrahydroindole-2-carboxylic acid prop-2-enyl ester MLS000116495 cid_5308217 prop-2-enyl 3-methyl-4-oxo-6-(3,4,5-trimethoxyphenyl)-1,5,6,7-tetrahydroindole-2-carboxylate
TypeSmall organic molecule
Emp. Form.C22H25NO6
Mol. Mass.399.437
SMILESCOc1cc(cc(OC)c1OC)C1Cc2[nH]c(C(=O)OCC=C)c(C)c2C(=O)C1