Reaction Details
TargetZinc finger protein GLI1
LigandBDBM49428
Substrate/Competitorn/a
Meas. Tech.Dose response confirmation of uHTS antagonist hits from Gli-SUFU in a luminescent reporter assay
IC50 1060±n/a nM
Citation PubChem, PC Dose response confirmation of uHTS antagonist hits from Gli-SUFU in a luminescent reporter assay PubChem Bioassay(2012)[AID]
 
Zinc finger protein GLI1
Name:Zinc finger protein GLI1
Type:PROTEIN
Mol. Mass.:118579.34
Organism:Mus musculus
Description:EBI_101259
Residue:1111
BDBM49428
NameBDBM49428
Synonyms:(4-heptoxyphenyl) pyridine-3-carboxylate MLS000518891 cid_4456997 | nicotinic acid (4-heptoxyphenyl) ester
TypeSmall organic molecule
Emp. Form.C19H23NO3
Mol. Mass.313.3908
SMILESCCCCCCCOc1ccc(OC(=O)c2cccnc2)cc1