Reaction Details
TargetZinc finger protein GLI1
LigandBDBM65186
Substrate/Competitorn/a
Meas. Tech.Dose response confirmation of uHTS antagonist hits from Gli-SUFU in a luminescent reporter assay
IC50 2510±n/a nM
Citation PubChem, PC Dose response confirmation of uHTS antagonist hits from Gli-SUFU in a luminescent reporter assay PubChem Bioassay(2012)[AID]
 
Zinc finger protein GLI1
Name:Zinc finger protein GLI1
Type:PROTEIN
Mol. Mass.:118579.34
Organism:Mus musculus
Description:EBI_101259
Residue:1111
BDBM65186
NameBDBM65186
Synonyms:Dodecyl-dimethyl-prop-2-ynyl-ammonium SMR000217471 dodecyl-dimethyl-prop-2-ynyl-azanium;bromide dodecyl-dimethyl-prop-2-ynylazanium;bromide | lauryl-dimethyl-propargyl-ammonium;bromide
TypeSmall organic molecule
Emp. Form.C17H34N
Mol. Mass.252.458
SMILESCCCCCCCCCCCC[N+](C)(C)CC#C