Reaction Details
TargetZinc finger protein GLI1
LigandBDBM68071
Substrate/Competitorn/a
Meas. Tech.Dose response confirmation of uHTS antagonist hits from Gli-SUFU in a luminescent reporter assay
IC50 1260±n/a nM
Citation PubChem, PC Dose response confirmation of uHTS antagonist hits from Gli-SUFU in a luminescent reporter assay PubChem Bioassay(2012)[AID]
 
Zinc finger protein GLI1
Name:Zinc finger protein GLI1
Type:PROTEIN
Mol. Mass.:118579.34
Organism:Mus musculus
Description:EBI_101259
Residue:1111
BDBM68071
NameBDBM68071
Synonyms:MLS000374456 N-[4-(1-benzofuran-2-yl)-1,3-thiazol-2-yl]-4-(2,6-dimethylmorpholin-4-yl)sulfonylbenzamide N-[4-(benzofuran-2-yl)thiazol-2-yl]-4-(2,6-dimethylmorpholino)sulfonyl-benzamide cid_3942275
TypeSmall organic molecule
Emp. Form.C24H23N3O5S2
Mol. Mass.497.587
SMILESCC1CN(CC(C)O1)S(=O)(=O)c1ccc(cc1)C(=O)Nc1nc(cs1)-c1cc2ccccc2o1