Reaction Details
TargetZinc finger protein GLI1
LigandBDBM53616
Substrate/Competitorn/a
Meas. Tech.Dose response confirmation of uHTS antagonist hits from Gli-SUFU in a luminescent reporter assay
IC50 2060±n/a nM
Citation PubChem, PC Dose response confirmation of uHTS antagonist hits from Gli-SUFU in a luminescent reporter assay PubChem Bioassay(2012)[AID]
 
Zinc finger protein GLI1
Name:Zinc finger protein GLI1
Type:PROTEIN
Mol. Mass.:118579.34
Organism:Mus musculus
Description:EBI_101259
Residue:1111
BDBM53616
NameBDBM53616
Synonyms:1-ethyl-2,3,3,5-tetramethyl-3H-indolium 1-ethyl-2,3,3,5-tetramethylindol-1-ium;iodide SMR000311984 | cid_110119
TypeSmall organic molecule
Emp. Form.C14H20N
Mol. Mass.202.3148
SMILESCC[N+]1=C(C)C(C)(C)c2cc(C)ccc12