Reaction Details
TargetZinc finger protein GLI1
LigandBDBM89373
Substrate/Competitorn/a
Meas. Tech.Dose response confirmation of uHTS antagonist hits from Gli-SUFU in a luminescent reporter assay
IC50 1020±n/a nM
Citation PubChem, PC Dose response confirmation of uHTS antagonist hits from Gli-SUFU in a luminescent reporter assay PubChem Bioassay(2012)[AID]
 
Zinc finger protein GLI1
Name:Zinc finger protein GLI1
Type:PROTEIN
Mol. Mass.:118579.34
Organism:Mus musculus
Description:EBI_101259
Residue:1111
BDBM89373
NameBDBM89373
Synonyms:1-[4-(4-bromophenyl)-1,3-thiazol-2-yl]azepane 2-(azepan-1-yl)-4-(4-bromophenyl)-1,3-thiazole MLS001178940 cid_838339
TypeSmall organic molecule
Emp. Form.C15H17BrN2S
Mol. Mass.337.278
SMILESBrc1ccc(cc1)-c1csc(n1)N1CCCCCC1