Reaction Details
TargetZinc finger protein GLI1
LigandBDBM89387
Substrate/Competitorn/a
Meas. Tech.Dose response confirmation of uHTS antagonist hits from Gli-SUFU in a luminescent reporter assay
IC50 368±n/a nM
Citation PubChem, PC Dose response confirmation of uHTS antagonist hits from Gli-SUFU in a luminescent reporter assay PubChem Bioassay(2012)[AID]
 
Zinc finger protein GLI1
Name:Zinc finger protein GLI1
Type:PROTEIN
Mol. Mass.:118579.34
Organism:Mus musculus
Description:EBI_101259
Residue:1111
BDBM89387
NameBDBM89387
Synonyms:MLS001214654 cid_16404087
TypeSmall organic molecule
Emp. Form.C23H37NO8
Mol. Mass.455.5418
SMILES[H][C@@]12CCC3(C)OOC11C(CC[C@H]2C)C(C)C(OC(=O)CCC(=O)NC(C)(C)CO)O[C@@]1([H])O3