Reaction Details
TargetCorticotropin-releasing factor-binding protein
LigandBDBM44436
Substrate/Competitorn/a
Meas. Tech.Dose Response confirmation of uHTS hits for small molecule agonists of the CRF-binding protein and CRF-R2 receptor complex
EC50 5230±n/a nM
Citation PubChem, PC Dose Response confirmation of uHTS hits for small molecule agonists of the CRF-binding protein and CRF-R2 receptor complex PubChem Bioassay(2012)[AID]
 
Corticotropin-releasing factor-binding protein
Name:Corticotropin-releasing factor-binding protein
Type:Enzyme Catalytic Domain
Mol. Mass.:36143.95
Organism:Homo sapiens (Human)
Description:P24387
Residue:322
BDBM44436
NameBDBM44436
Synonyms:3-phenyl-1-propyl-pyrazolo[4,3-b]quinoxaline MLS000040578 cid_664831
TypeSmall organic molecule
Emp. Form.C18H16N4
Mol. Mass.288.3464
SMILESCCCn1nc(-c2ccccc2)c2nc3ccccc3nc12