Reaction Details
TargetCorticotropin-releasing factor-binding protein
LigandBDBM83003
Substrate/Competitorn/a
Meas. Tech.Dose Response confirmation of uHTS hits for small molecule agonists of the CRF-binding protein and CRF-R2 receptor complex
EC50>53000±n/a nM
Citation PubChem, PC Dose Response confirmation of uHTS hits for small molecule agonists of the CRF-binding protein and CRF-R2 receptor complex PubChem Bioassay(2012)[AID]
 
Corticotropin-releasing factor-binding protein
Name:Corticotropin-releasing factor-binding protein
Type:Enzyme Catalytic Domain
Mol. Mass.:36143.95
Organism:Homo sapiens (Human)
Description:P24387
Residue:322
BDBM83003
NameBDBM83003
Synonyms:(6E)-5-azanylidene-6-[[3-methoxy-4-[2-(4-methylphenoxy)ethoxy]phenyl]methylidene]-2-methylsulfonyl-[1,3,4]thiadiazolo[3,2-a]pyrimidin-7-one (6E)-5-imino-6-[[3-methoxy-4-[2-(4-methylphenoxy)ethoxy]phenyl]methylidene]-2-methylsulfonyl-[1,3,4]thiadiazolo[3,2-a]pyrimidin-7-one MLS001199626 cid_24792310
TypeSmall organic molecule
Emp. Form.C23H22N4O6S2
Mol. Mass.514.574
SMILESCOc1cc(C=C2C(=O)N=C3SC(=NN3C2=N)S(C)(=O)=O)ccc1OCCOc1ccc(C)cc1