Reaction Details
TargetATP-binding cassette sub-family B member 6
LigandBDBM67355
Substrate/Competitorn/a
Meas. Tech.Dose Response of Flow Cytometric HTS Screen for inhibitors of the ABC transporter ABCB6 for Cherry Pick01
EC50 62790±n/a nM
Citation PubChem, PC Dose Response of Flow Cytometric HTS Screen for inhibitors of the ABC transporter ABCB6 for Cherry Pick01 PubChem Bioassay(2012)[AID]
 
ATP-binding cassette sub-family B member 6
Name:ATP-binding cassette sub-family B member 6
Type:Enzyme Catalytic Domain
Mol. Mass.:93896.51
Organism:Homo sapiens (Human)
Description:gi_9955963
Residue:842
BDBM67355
NameBDBM67355
Synonyms:2-benzylsulfonyl-5-chloro-N-(4-fluorophenyl)pyrimidine-4-carboxamide 5-chloro-N-(4-fluorophenyl)-2-(phenylmethyl)sulfonyl-4-pyrimidinecarboxamide SMR000625770 | cid_16446684
TypeSmall organic molecule
Emp. Form.C18H13ClFN3O3S
Mol. Mass.405.831
SMILESFc1ccc(NC(=O)c2nc(ncc2Cl)S(=O)(=O)Cc2ccccc2)cc1