Reaction Details
TargetMultidrug resistance protein CDR1
LigandBDBM84145
Substrate/Competitorn/a
Meas. Tech.Dose Response HTS singleplex for inhibitors of yeast efflux pump, specifically Cdr1 with Cherry Pick2 compound set
EC50 23850±n/a nM
Citation PubChem, PC Dose Response HTS singleplex for inhibitors of yeast efflux pump, specifically Cdr1 with Cherry Pick2 compound set PubChem Bioassay(2012)[AID]
 
Multidrug resistance protein CDR1
Name:Multidrug resistance protein CDR1
Type:PROTEIN
Mol. Mass.:169942.67
Organism:Candida albicans
Description:ChEMBL_708756
Residue:1501
BDBM84145
NameBDBM84145
Synonyms:MLS000877364 cid_16682129
TypeSmall organic molecule
Emp. Form.C25H25FN2O4
Mol. Mass.436.4754
SMILESCC(C)C(=O)N1CCC2(CC1)Oc1ccc(F)cc1C(=O)C21CC(=NO1)c1ccccc1