Reaction Details
TargetMultidrug resistance protein CDR1
LigandBDBM91525
Substrate/Competitorn/a
Meas. Tech.Dose Response HTS singleplex for inhibitors of yeast efflux pump, specifically Cdr1 with Cherry Pick2 compound set
EC50 17300±n/a nM
Citation PubChem, PC Dose Response HTS singleplex for inhibitors of yeast efflux pump, specifically Cdr1 with Cherry Pick2 compound set PubChem Bioassay(2012)[AID]
 
Multidrug resistance protein CDR1
Name:Multidrug resistance protein CDR1
Type:PROTEIN
Mol. Mass.:169942.67
Organism:Candida albicans
Description:ChEMBL_708756
Residue:1501
BDBM91525
NameBDBM91525
Synonyms:MLS002174181 cid_42601169
TypeSmall organic molecule
Emp. Form.C28H26N2O4
Mol. Mass.454.517
SMILES[H][C@]12COc3cc(OC)ccc3[C@]1([H])N1C(=O)c3ccc(C)cc3NC(=O)[C@@]1(C)[C@H]2c1ccccc1