Reaction Details
TargetDNA dC->dU-editing enzyme APOBEC-3G
LigandBDBM80421
Substrate/Competitorn/a
Meas. Tech.SAR analysis of small molecule inhibitors of APOBEC3G DNA Deaminase via a fluorescence-based single-stranded DNA deaminase assay - Set 2
Temperature298.15±n/a K
IC50 1540±n/a nM
Commentsextracted
Citation PubChem, PC SAR analysis of small molecule inhibitors of APOBEC3G DNA Deaminase via a fluorescence-based single-stranded DNA deaminase assay - Set 2 PubChem Bioassay(2012)[AID]
 
DNA dC->dU-editing enzyme APOBEC-3G
Name:DNA dC->dU-editing enzyme APOBEC-3G
Type:Enzyme Catalytic Domain
Mol. Mass.:46419.54
Organism:Homo sapiens (Human)
Description:gi_13399304
Residue:384
BDBM80421
NameBDBM80421
Synonyms:2-[(5-amino-1,3,4-thiadiazol-2-yl)sulfanyl]-N-[2-[2-(tert-butylamino)-2-oxoethyl]sulfanyl-1,3-benzothiazol-6-yl]acetamide 2-[(5-amino-1,3,4-thiadiazol-2-yl)thio]-N-[2-[[2-(tert-butylamino)-2-keto-ethyl]thio]-1,3-benzothiazol-6-yl]acetamide 2-[(5-azanyl-1,3,4-thiadiazol-2-yl)sulfanyl]-N-[2-[2-(tert-butylamino)-2-oxidanylidene-ethyl]sulfanyl-1,3-benzothiazol-6-yl]ethanamide SMR000197240 | cid_1567968
TypeSmall organic molecule
Emp. Form.C17H20N6O2S4
Mol. Mass.468.64
SMILESCC(C)(C)NC(=O)CSc1nc2ccc(NC(=O)CSc3nnc(N)s3)cc2s1