Reaction Details
TargetDNA dC->dU-editing enzyme APOBEC-3G
LigandBDBM80356
Substrate/Competitorn/a
Meas. Tech.SAR analysis of small molecule inhibitors of APOBEC3G DNA Deaminase via a fluorescence-based single-stranded DNA deaminase assay - Set 2
Temperature298.15±n/a K
IC50 695±n/a nM
Commentsextracted
Citation PubChem, PC SAR analysis of small molecule inhibitors of APOBEC3G DNA Deaminase via a fluorescence-based single-stranded DNA deaminase assay - Set 2 PubChem Bioassay(2012)[AID]
 
DNA dC->dU-editing enzyme APOBEC-3G
Name:DNA dC->dU-editing enzyme APOBEC-3G
Type:Enzyme Catalytic Domain
Mol. Mass.:46419.54
Organism:Homo sapiens (Human)
Description:gi_13399304
Residue:384
BDBM80356
NameBDBM80356
Synonyms:MLS000036597 N-[3-[5-[2-(furan-2-ylmethylamino)-2-oxoethyl]sulfanyl-4-methyl-1,2,4-triazol-3-yl]phenyl]propanamide N-[3-[5-[[2-(2-furfurylamino)-2-keto-ethyl]thio]-4-methyl-1,2,4-triazol-3-yl]phenyl]propionamide cid_661469
TypeSmall organic molecule
Emp. Form.C19H21N5O3S
Mol. Mass.399.467
SMILESCCC(=O)Nc1cccc(c1)-c1nnc(SCC(=O)NCc2ccco2)n1C