Reaction Details
TargetDNA dC->dU-editing enzyme APOBEC-3G
LigandBDBM46661
Substrate/Competitorn/a
Meas. Tech.SAR analysis of small molecule inhibitors of APOBEC3G DNA Deaminase via a fluorescence-based single-stranded DNA deaminase assay - Set 2
Temperature298.15±n/a K
IC50 1220±n/a nM
Commentsextracted
Citation PubChem, PC SAR analysis of small molecule inhibitors of APOBEC3G DNA Deaminase via a fluorescence-based single-stranded DNA deaminase assay - Set 2 PubChem Bioassay(2012)[AID]
 
DNA dC->dU-editing enzyme APOBEC-3G
Name:DNA dC->dU-editing enzyme APOBEC-3G
Type:Enzyme Catalytic Domain
Mol. Mass.:46419.54
Organism:Homo sapiens (Human)
Description:gi_13399304
Residue:384
BDBM46661
NameBDBM46661
Synonyms:5-(4-methoxyphenyl)-1,2-dihydro-1,2,4-triazole-3-thione cid_689101
TypeSmall organic molecule
Emp. Form.C9H9N3OS
Mol. Mass.207.252
SMILESCOc1ccc(cc1)-c1n[nH]c(=S)[nH]1